{"text_format":"1","workbook":"xlsx","n_sheets":3,"sheets":["Fixed Aid","Buoy","Sheet1"],"not_rendered":{"charts":2,"images":0,"macros":1,"external_links":0,"defined_names":2,"comments":0,"pivot_tables":0},"unopened":[],"bounds":{"document_bytes":16777216,"sheet_cells":100000,"rows_first":2000,"rows_last":500,"rows_between":2000,"halvings":0,"cell_chars":16384,"cell_head_chars":4096},"cells_cut":0,"cells_raw":0,"read":"whole","date_system":"1900"}

{"sheet":"Fixed Aid","index":0,"n_rows":374,"n_cols":48,"rows_kept":374,"cut":false,"hidden":false,"merged":[[28,12,29,17],[32,12,32,13],[32,14,32,15],[32,16,32,17],[34,12,34,13],[34,14,34,15],[34,16,34,17],[33,12,33,13],[33,14,33,15],[33,16,33,17],[33,2,33,9],[34,2,34,9],[35,2,35,9],[30,2,31,9],[2,2,2,7],[24,2,24,7],[26,2,26,7],[28,2,28,7],[22,2,22,7],[3,2,3,7]]}
[null,null,null,null,null,null,null,null,null,null,null,null,null,null,null,null,null,null,null,null,null,null,null,null,"FIXED"]
[null,null,null,null,null,null,null,null,null,null,null,null,null,null,null,null,null,null,null,null,null,null,null,null,null,null,null,null,null,null,null,null,null,null,null,null,"1 yard","1 yard",null,null,null,null,"1 yrd","3yrds","2DRMS"]
[null,null,"D7NS 1010                                           IS THIS BEACON IN ITS AP?",null,null,null,null,null,null,null,null,null,null,null,null,null,null,null,null,null,null,null,null,null,null,null,null,null,null,null,null,null,null,null,null,null,{"$f":"AK5/AK22","v":8.2142425988774217E-6},{"$f":"AL5/AL22","v":9.2671460569163507E-6},null,null,null,"Lon",{"$f":"AL3","v":9.2671460569163507E-6},{"$f":"AQ3*3","v":2.7801438170749054E-5},{"$f":"AQ3*AD19","v":5.5602876341498108E-5}]
[null,null,"USE ONLY IF FIX OBTAINED WITH GPS ON THE PILING",null,null,null,null,null,null,null,null,null,null,null,null,null,null,null,null,null,null,null,null,null,null,null,null,null,null,null,null,null,null,null,null,null,null,null,null,null,null,"Lat",{"$f":"AK3","v":8.2142425988774217E-6},{"$f":"AQ4*3","v":2.4642727796632265E-5},{"$f":"AQ4*AD19","v":4.928545559326453E-5}]
[null,null,"LLNR",24885,null,"DATE:",null,"2022-09-05",null,null,null,null,null,null,null,null,null,null,null,null,null,null,null,null,null,null,null,null,null,null,null,null,null,null,null,null,1E-3,1E-3]
[null,null,"FIX",null,null,null,null,null,null,null,null,null,null,null,null,null,null,null,null,null,null,null,null,null,null,null,null,null,null,"Degrees","Radians",null,null,null,null,null,"scaleLat","scaleLong",null,null,null,null,null,"X","Y"]
[null,null,"Latitude",27,"°",34,"'",40,"''","N",null,null,null,null,null,null,null,null,null,null,null,null,null,null,null,"ERROR CALCULATIONS",null,null,"Lat1",{"$f":"D7+F7/60+H7/60/60","v":27.577777777777779},{"$f":"AD7*PI()/180","v":0.48132302260554738},null,null,null,null,null,{"$f":"AD11+AK5","v":27.57877777777778},{"$f":"AD11","v":27.577777777777779},null,null,null,null,"Fix",{"$f":"IF(AB35<>0,0,#N/A)","v":0},{"$f":"IF(AB35<>0,0,#N/A)","v":0}]
[null,null,"Longitude",81,"°",30,"'",15,"''","W",null,null,null,null,null,null,null,null,null,null,null,null,null,null,null,"EPE",2.4022000000000001,null,"Lon1",{"$f":"-(D8+F8/60+H8/60/60)","v":-81.504166666666663},{"$f":"AD8*PI()/180","v":-1.422516062427545},null,null,null,null,null,{"$f":"AD12","v":-81.504166666666663},{"$f":"AD12+AL5","v":-81.503166666666658},null,null,null,null,"AP",{"$f":"IF(AB35<>0,-AD11+AD7,#N/A)","v":0},{"$f":"IF(AB35<>0,-AD12+AD8,#N/A)","v":0}]
[null,null,null,"* Longitude will always assumed to be a negative value for US Coasts in D7",null,null,null,null,null,null,null,null,null,null,null,null,null,null,null,null,null,null,null,null,null,"CPE",2.4022000000000001,null,null,null,null,null,null,null,null,null,{"$f":"AK7*PI()/180","v":0.48134047589806733},{"$f":"AL7*PI()/180","v":0.48132302260554738}]
[null,null,"AP (Assigned Position)",null,null,null,null,null,null,null,null,null,null,null,null,null,null,null,null,null,null,null,null,null,null,"DRMS",2,null,null,null,null,null,null,null,null,null,{"$f":"AK8*PI()/180","v":-1.422516062427545},{"$f":"AL8*PI()/180","v":-1.4224986091350249}]
[null,null,"Latitude",27,"°",34,"'",40,"''","N",null,null,null,null,null,null,null,null,null,null,null,null,null,null,null,"2DRMS",1,null,"Lat1",{"$f":"D11+F11/60+H11/60/60","v":27.577777777777779},{"$f":"AD11*PI()/180","v":0.48132302260554738},null,null,null,null,null,{"$f":"AD11","v":27.577777777777779},{"$f":"AD11","v":27.577777777777779}]
[null,null,"Longitude",81,"°",30,"'",15,"''","W",null,null,null,null,null,null,null,null,null,null,null,null,null,null,null,"R95",1.1555,null,"Lon1",{"$f":"-(D12+F12/60+H12/60/60)","v":-81.504166666666663},{"$f":"AD12*PI()/180","v":-1.422516062427545},null,null,null,null,null,{"$f":"AD12","v":-81.504166666666663},{"$f":"AD12","v":-81.504166666666663}]
[null,null,null,"* Longitude will always assumed to be a negative value for US Coasts in D7",null,null,null,null,null,null,null,null,null,null,null,null,null,null,null,null,null,null,null,null,null,"R99.7",0.89280000000000004,null,null,{"$f":"ABS(AD7-AD11)","v":0},null,null,null,null,null,null,{"$f":"AK11*PI()/180","v":0.48132302260554738},{"$f":"AL11*PI()/180","v":0.48132302260554738}]
[null,null,"GPS Error","Select Type",null,"Error Value",null,"Select Unit",null,null,null,null,null,null,null,null,null,null,null,null,null,null,null,null,null,"feet",29.527200000000001,1,null,{"$f":"ABS(AD8-AD12)","v":0},null,null,null,null,null,null,{"$f":"AK12*PI()/180","v":-1.422516062427545},{"$f":"AL12*PI()/180","v":-1.422516062427545},null,null,null,null,null,"3 yard Radius",null,null,"2DRMS"]
[null,null,null,"2DRMS",null,18,null,"feet",null,null,null,null,null,null,null,null,null,null,null,null,null,null,null,null,null,"yards",9.8000000000000007,3,null,null,null,null,null,null,null,null,3443.89849,3443.89849,null,null,null,0,{"$f":"AP15*PI()/180","v":0},{"$f":"$AR$7+$AR$4*SIN(AQ15)","v":0},{"$f":"$AS$7+$AR$3*COS(AQ15)","v":2.7801438170749054E-5},null,{"$f":"$AR$7+$AS$4*SIN(AQ15)","v":0},{"$f":"$AS$7+$AS$3*COS(AQ15)","v":5.5602876341498108E-5}]
[null,null,null,null,null,null,null,null,null,null,null,null,null,null,null,null,null,null,null,null,null,null,null,null,null,"meters",9,{"$f":"AA15/AA16*3","v":3.2666666666666671},null,null,null,null,null,null,null,null,{"$f":"AK13-AK9","v":-1.7453292519953312E-5},{"$f":"AL13-AL9","v":0},null,null,null,1,1.7453292519943295E-2,4.3007490123017027E-7,2.7797203877056359E-5,null,8.6014980246034055E-7,5.5594407754112718E-5]
[null,null,null,null,null,null,null,null,null,null,null,null,null,null,null,null,null,null,null,null,null,null,null,null,null,null,"2DMRS",null,"Maxiumum 2DRMS",{"$f":"9*3.2808","v":29.527200000000001},"ft",null,null,null,null,null,{"$f":"AK14-AK10","v":0},{"$f":"AL14-AL10","v":-1.7453292520119845E-5},null,null,null,2,3.4906585039886591E-2,8.6001879747919674E-7,2.7784502285785152E-5,null,1.7200375949583935E-6,5.5569004571570305E-5]
[null,null,{"$f":"IF('Fixed Aid'!$AB$35>0,\"Distance from Fix to AP\",\"\")","v":"Distance from Fix to AP"},{"$f":"IF('Fixed Aid'!$AB$35>0,TEXT('Fixed Aid'!AA23,\"0.00\"& \" ft\"),\"\")","v":"0.00 ft"},null,{"$f":"IF('Fixed Aid'!$AB$35>0,\"=   \"&TEXT('Fixed Aid'!AA24,\"0.00\")&\" yd\",\"\")","v":"=   0.00 yd"},null,null,null,null,null,null,null,null,null,null,null,null,null,null,null,null,null,null,null,null,{"$f":"VLOOKUP(D15,'Fixed Aid'!$Z$8:$AA$13,2,FALSE)*F15","v":18},{"$f":"H15","v":"feet"},null,null,null,null,null,null,null,null,{"$f":" (SIN($AK$16/2))^2+COS($AK$9)*COS($AK$13)*(SIN($AK$17/2))^2","v":7.6154354944831399E-11},{"$f":" (SIN($AL$16/2))^2+COS($AL$9)*COS($AL$13)*(SIN($AL$17/2))^2","v":5.9832586641043709E-11},null,null,null,3,5.2359877559829883E-2,1.2897007236713218E-6,2.7763337265963179E-5,null,2.5794014473426436E-6,5.5526674531926357E-5]
[null,null,null,null,null,null,null,null,null,null,null,null,null,null,null,null,null,null,null,null,null,null,null,null,null,null,{"$f":"VLOOKUP(D15,'Fixed Aid'!$Z$8:$AA$13,2,FALSE)*F15*VLOOKUP(H15,'Fixed Aid'!$Z$14:$AB$16,3,FALSE)","v":18},"feet",null,{"$f":"IF('Fixed Aid'!AA19<>0,'Fixed Aid'!AA19/3,\"\")","v":6},"yards",null,null,null,null,null,{"$f":"2*ATAN2(SQRT(1-$AK$18),SQRT($AK$18))","v":1.7453292519953312E-5},{"$f":"2*ATAN2(SQRT(1-$AL$18),SQRT($AL$18))","v":1.5470305315957669E-5},null,null,null,4,6.9813170079773182E-2,1.7189897945294053E-6,2.7733715264660502E-5,null,3.4379795890588107E-6,5.5467430529321005E-5]
[null,null,{"$f":"IF('Fixed Aid'!$AB$35>0,\"Bearing from Fix to AP\",\"\")","v":"Bearing from Fix to AP"},{"$f":"IF('Fixed Aid'!$AB$35>0,'Fixed Aid'!AA26,\"\")","v":"N/A"},{"$f":"IF(AND('Fixed Aid'!$AB$35>0,NOT(ISERROR(AD31))),\"°T\",\"\")","v":""},null,null,null,null,null,null,null,null,null,null,null,null,null,null,null,null,null,null,null,null,null,null,null,null,null,null,null,null,null,null,null,null,null,null,null,null,5,8.7266462599716474E-2,2.1477552444438468E-6,2.7695645305025684E-5,null,4.2955104888876936E-6,5.5391290610051369E-5]
{"$rows_left_out":355}
{"sheet":"Buoy","index":1,"n_rows":374,"n_cols":49,"rows_kept":374,"cut":false,"hidden":false,"merged":[[31,12,31,13],[32,12,32,13],[33,12,33,13],[33,14,33,15],[33,16,33,17],[31,14,31,15],[31,16,31,17],[32,14,32,15],[32,16,32,17],[2,2,2,7],[33,2,33,9],[34,2,34,9],[16,3,16,7],[25,2,25,7],[27,2,27,7],[29,2,30,9],[32,2,32,9],[3,2,3,7]]}
[null,null,null,null,null,null,null,null,null,null,null,null,null,null,null,null,null,null,null,null,null,null,null,null,null,"BUOY"]
[null,null,null,null,null,null,null,null,null,null,null,null,null,null,null,null,null,null,null,null,null,null,null,null,null,null,null,null,null,null,null,null,null,null,null,null,null,"1 yard","1 yard",null,null,null,null,"1 yrd","PT circle","2DRMS"]
[null,null,"D7NS 1010                                                IS THIS BUOY ON STATION?",null,null,null,null,null,null,null,null,null,null,null,null,null,null,null,null,null,null,null,null,null,null,null,null,null,null,null,null,null,null,null,null,null,null,{"$f":"AL5/AL22","v":8.2142425988774217E-6},{"$f":"AM5/AM22","v":9.2190599910674295E-6},null,null,null,"Lon",{"$f":"AM3","v":9.2190599910674295E-6},{"$f":"AM3*Buoy!D18","v":2.3047649977668574E-4},{"$f":"AR3*AD19","v":6.146039994044953E-5}]
[null,null,"USE THIS CALCULATOR ONLY IF YOU LOCATED THE BUOY SINKER",null,null,null,null,null,null,null,null,null,null,null,null,null,null,null,null,null,null,null,null,null,null,null,null,null,null,null,null,null,null,null,null,null,null,null,null,null,null,null,"Lat",{"$f":"AL3","v":8.2142425988774217E-6},{"$f":"AL3*Buoy!D18","v":2.0535606497193554E-4},{"$f":"AL3*AD19","v":5.4761617325849483E-5}]
[null,null,"LLNR",24885,null,"DATE:",null,"2021-11-13",null,null,null,null,null,null,null,null,null,null,null,null,null,null,null,null,null,null,null,null,null,"Degrees","Radians",null,null,null,null,null,null,1E-3,1E-3]
[null,null,"FIX","Deg",null,"Min",null,"Sec",null,null,null,null,null,null,null,null,null,null,null,null,null,null,null,null,null,null,null,null,null,null,null,null,null,null,null,null,null,"scaleLat","scaleLong",null,null,null,null,null,"X","Y"]
[null,null,"Latitude",27,"°",0,"'",0,"''","N",null,null,null,null,null,null,null,null,null,null,null,null,null,null,null,null,null,null,"Lat1",{"$f":"Buoy!D7+Buoy!F7/60+Buoy!H7/60/60","v":27},{"$f":"AD7*PI()/180","v":0.47123889803846897},null,null,null,null,null,null,{"$f":"AD11+AL5","v":27.001000000000001},{"$f":"AD11","v":27},null,null,null,null,"Fix",{"$f":"IF($AA$40<>0,AD11-AD7,#N/A)","v":0},{"$f":"IF($AA$40<>0,AD12-AD8,#N/A)","v":0}]
[null,null,"Longitude",80,"°",0,"'",0,"''","W",null,null,null,null,null,null,null,null,null,null,null,null,null,null,null,null,null,null,"Lon1",{"$f":"-(Buoy!D8+Buoy!F8/60+Buoy!H8/60/60)","v":-80},{"$f":"AD8*PI()/180","v":-1.3962634015954636},null,null,null,null,null,null,{"$f":"AD12","v":-80},{"$f":"AD12+AM5","v":-79.998999999999995},null,null,null,null,"AP",{"$f":"IF($AA$40<>0,0,#N/A)","v":0},{"$f":"IF($AA$40<>0,0,#N/A)","v":0}]
[null,null,null,12,null,null,null,null,null,null,null,null,null,null,null,null,null,null,null,null,null,null,null,null,null,null,null,null,null,null,null,null,null,null,null,null,null,{"$f":"AL7*PI()/180","v":0.47125635133098892},{"$f":"AM7*PI()/180","v":0.47123889803846897}]
[null,null,"AP (Assigned Position)",null,null,null,null,null,null,null,null,null,null,null,null,null,null,null,null,null,null,null,null,null,null,null,null,null,null,null,null,null,null,null,null,null,null,{"$f":"AL8*PI()/180","v":-1.3962634015954636},{"$f":"AM8*PI()/180","v":-1.3962459483029437}]
[null,null,"Latitude",27,"°",0,"'",0,"''","N",null,null,null,null,null,null,null,null,null,null,null,null,null,null,null,null,null,null,"Lat2",{"$f":"Buoy!D11+Buoy!F11/60+Buoy!H11/60/60","v":27},{"$f":"AD11*PI()/180","v":0.47123889803846897},null,null,null,null,null,null,{"$f":"AD11","v":27},{"$f":"AD11","v":27}]
[null,null,"Longitude",80,"°",0,"'",0,"''","W",null,null,null,null,null,null,null,null,null,null,null,null,null,null,null,null,null,null,"Lon2",{"$f":"-(Buoy!D12+Buoy!F12/60+Buoy!H12/60/60)","v":-80},{"$f":"AD12*PI()/180","v":-1.3962634015954636},null,null,null,null,null,null,{"$f":"AD12","v":-80},{"$f":"AD12","v":-80}]
[null,null,null,null,null,null,null,null,null,null,null,null,null,null,null,null,null,null,null,null,null,null,null,null,null,null,null,null,null,null,null,null,null,null,null,null,null,{"$f":"AL11*PI()/180","v":0.47123889803846897},{"$f":"AM11*PI()/180","v":0.47123889803846897}]
[null,null,"GPS Error","Type",null,"Error Value",null,"Unit",null,null,null,null,null,null,null,null,null,null,null,null,null,null,null,null,null,null,null,null,null,null,null,null,null,null,null,null,null,{"$f":"AL12*PI()/180","v":-1.3962634015954636},{"$f":"AM12*PI()/180","v":-1.3962634015954636},null,null,null,null,null,"PT circle",null,null,"2DRMS"]
[null,null,null,"DRMS",null,10,null,"feet",null,null,null,null,null,null,null,null,null,null,null,null,null,null,null,null,null,null,null,null,null,null,null,null,null,null,null,null,null,3443.89849,3443.89849,null,null,null,0,{"$f":"AQ15*PI()/180","v":0},{"$f":"$AS$8+$AS$4*SIN(AR15)","v":0},{"$f":"$AT$8+$AS$3*COS(AR15)","v":2.3047649977668574E-4},null,{"$f":"$AS$7+$AT$4*SIN(AR15)","v":0},{"$f":"$AT$7+$AT$3*COS(AR15)","v":6.146039994044953E-5}]
[null,null,null,null,null,null,null,null,null,null,null,null,null,null,null,null,null,null,null,null,null,null,null,null,null,null,null,null,null,null,null,null,null,null,null,null,null,{"$f":"AL13-AL9","v":-1.7453292519953312E-5},{"$f":"AM13-AM9","v":0},null,null,null,1,1.7453292519943295E-2,3.583957510251419E-6,2.3044139708943177E-4,null,9.5572200273371179E-7,6.1451039223848472E-5]
[null,null,"Waterway Type","Deep/Shallow Water Not Maintained-Unrestricted",null,null,null,null,null,null,null,null,null,null,null,null,null,null,null,null,null,null,null,null,null,null,"2DMRS",null,"Maxiumum 2DRMS",null,{"$f":"9*3.2808","v":29.527200000000001},"ft",null,null,null,null,null,{"$f":"AL14-AL10","v":0},{"$f":"AM14-AM10","v":-1.7453292519897801E-5},null,null,null,2,3.4906585039886591E-2,7.1668233123266392E-6,2.3033609972028841E-4,null,1.9111528832871038E-6,6.1422959925410247E-5]
[null,null,{"$f":"IF(LEN(D18),\"Positioning Tolerance\",\"\")","v":"Positioning Tolerance"},{"$f":"IF(D17=\"Deep/Shallow Water Maintained-Restricted\",15,IF(D17=\"Deep/Shallow Water Not Maintained-Unrestricted\",25,IF(D17=\"Sea Coastal and Coastal\",40,\"\")))","v":25},null,{"$f":"IF(LEN(D18),\"yards\",\"\")","v":"yards"},null,null,null,null,null,null,null,null,null,null,null,null,null,null,null,null,null,null,null,null,{"$f":"VLOOKUP(D15,'Fixed Aid'!$Z$8:$AA$13,2,FALSE)*F15","v":20},{"$f":"H15","v":"feet"},null,null,null,null,null,null,null,null,null,{"$f":" (SIN($AL$16/2))^2+COS($AL$9)*COS($AL$13)*(SIN($AL$17/2))^2","v":7.6154354944831399E-11},{"$f":" (SIN($AM$16/2))^2+COS($AM$9)*COS($AM$13)*(SIN($AM$17/2))^2","v":6.0458380839240272E-11},null,null,null,3,5.2359877559829883E-2,1.0747506030594349E-5,2.3016063974385433E-4,null,2.8660016081584931E-6,6.1376170598361152E-5]
[null,null,null,null,null,null,null,null,null,null,null,null,null,null,null,null,null,null,null,null,null,null,null,null,null,null,{"$f":"VLOOKUP(D15,'Fixed Aid'!$Z$8:$AA$13,2,FALSE)*F15*VLOOKUP(H15,'Fixed Aid'!$Z$14:$AB$16,3,FALSE)","v":20},"feet",null,{"$f":"IF(Buoy!AA19/3<>0,Buoy!AA19/3,\"\")","v":6.666666666666667},"yards",null,null,null,null,null,null,{"$f":"2*ATAN2(SQRT(1-$AL$18),SQRT($AL$18))","v":1.7453292519953312E-5},{"$f":"2*ATAN2(SQRT(1-$AM$18),SQRT($AM$18))","v":1.55509975037563E-5},null,null,null,4,6.9813170079773182E-2,1.4324914954411711E-5,2.299150706069381E-4,null,3.8199773211764565E-6,6.1310685495183492E-5]
[null,null,null,null,null,null,null,null,null,null,null,null,null,null,null,null,null,null,null,null,null,null,null,null,null,null,null,null,null,null,null,null,null,null,null,null,null,null,null,null,null,null,5,8.7266462599716474E-2,1.7897960370365391E-5,2.2959946711227771E-4,null,4.7727894320974376E-6,6.1226524563274057E-5]
{"$rows_left_out":355}
{"sheet":"Sheet1","index":2,"n_rows":0,"n_cols":0,"rows_kept":0,"cut":false,"hidden":true,"merged":[]}